{"text_format":"1","workbook":"xlsx","n_sheets":9,"sheets":["Instructions","13 Week Cash Flow","Inputs","AR","AP","Headcount","Payroll Calendar","Other Cash Flows","Debt & Liquidity"],"not_rendered":{"charts":1,"images":1,"macros":0,"external_links":0,"defined_names":0,"comments":0,"pivot_tables":0},"unopened":[],"bounds":{"document_bytes":16777216,"sheet_cells":100000,"rows_first":2000,"rows_last":500,"rows_between":2000,"halvings":0,"cell_chars":16384,"cell_head_chars":4096},"cells_cut":0,"cells_raw":0,"read":"whole","date_system":"1900"}

{"sheet":"Instructions","index":0,"n_rows":44,"n_cols":4,"rows_kept":44,"cut":false,"hidden":false,"merged":[[24,0,24,1],[25,0,25,1],[26,0,26,1],[27,0,27,1],[30,0,30,1],[31,0,31,1],[32,0,32,1],[25,2,25,7],[26,2,26,7],[27,2,27,7],[29,0,29,7],[30,2,30,7],[31,2,31,7],[32,2,32,7],[0,0,1,7],[2,0,2,7],[4,0,4,7],[5,0,7,7],[9,0,9,7],[10,1,10,2],[10,3,10,7],[14,1,14,2],[15,1,15,2],[16,1,16,2],[11,1,11,2],[11,3,11,7],[12,1,12,2],[12,3,12,7],[13,1,13,2],[13,3,13,7],[14,3,14,7],[15,3,15,7],[16,3,16,7],[18,0,18,7],[19,0,19,1],[19,2,19,7],[20,0,20,1],[20,2,20,7],[21,0,21,1],[21,2,21,7],[22,0,22,1],[22,2,22,7],[23,0,23,1],[23,2,23,7],[24,2,24,7],[33,0,33,1],[34,0,34,1],[35,0,35,1],[36,0,36,1],[33,2,33,7],[34,2,34,7],[35,2,35,7],[36,2,36,7],[39,0,39,7],[40,0,42,7],[43,0,43,7]]}
["13-Week Cash Flow Forecast | Instructions"]
[]
["Cadence & Compass | Disciplined execution. Confident direction."]
[]
["Purpose & Overview"]
["This template is a direct-method 13-week cash flow forecast designed to help management teams understand near-term cash requirements and available liquidity. It converts expected customer collections, vendor payments, payroll, other cash flows and financing availability into a weekly view of ending cash and liquidity. Update the supporting schedules first; the 13 Week Cash Flow tab is intended primarily as an output and review page."]
[]
[]
[]
["How to Use the Template"]
["1","Set the forecast period",null,"On Inputs, enter the Forecast Start date, beginning cash, minimum cash threshold and debt/liquidity assumptions."]
["2","Update A/R",null,"List open receivables, expected collection percentages and the date cash is realistically expected to be received."]
["3","Update A/P",null,"List open payables, expected payment percentages and the date each payment is expected to clear."]
["4","Update headcount & payroll",null,"Enter employee compensation, burden, monthly benefits, start/termination dates and pay frequency. Maintain the Payroll Calendar for payroll timing."]
["5","Add other cash flows",null,"Enter material cash items not captured in A/R, A/P or payroll, including taxes, capex, settlements, owner/investor funding or other one-time items."]
{"$rows_left_out":30}
{"sheet":"13 Week Cash Flow","index":1,"n_rows":39,"n_cols":15,"rows_kept":39,"cut":false,"hidden":false,"merged":[[0,0,0,14],[1,0,1,14],[3,0,3,1],[5,0,5,1],[7,0,7,1],[8,0,8,1],[9,0,9,1],[10,0,10,1],[12,0,12,1],[13,0,13,1],[14,0,14,1],[15,0,15,1],[16,0,16,1],[18,0,18,1],[28,0,28,1],[29,0,29,1],[30,0,30,1],[33,0,33,5],[19,0,19,1],[21,0,21,1],[22,0,22,1],[23,0,23,1],[24,0,24,1],[25,0,25,1],[27,0,27,1]]}
["13-Week Cash Flow Forecast"]
[]
[]
["Week Ending",null,{"$f":"Inputs!B4+6","v":"2026-08-07"},{"$f":"C4+7","v":"2026-08-14"},"2026-08-21","2026-08-28","2026-09-04","2026-09-11","2026-09-18","2026-09-25","2026-10-02","2026-10-09","2026-10-16","2026-10-23","2026-10-30"]
[]
["Beginning Cash",null,{"$f":"Inputs!B6","v":375000},{"$f":"C26","v":360400},360400,422300,422300,515200,459450,415725,377508.055,283515.7473,283515.7473,276023.4396,276023.4396]
[]
["CASH RECEIPTS"]
["A/R Collections",null,{"$f":"SUMIFS(AR!$G$4:$G$200,AR!$H$4:$H$200,\">\"&C$4-7,AR!$H$4:$H$200,\"<=\"&C$4)","v":0},{"$f":"SUMIFS(AR!$G$4:$G$200,AR!$H$4:$H$200,\">\"&D$4-7,AR!$H$4:$H$200,\"<=\"&D$4)","v":0},{"$f":"SUMIFS(AR!$G$4:$G$200,AR!$H$4:$H$200,\">\"&E$4-7,AR!$H$4:$H$200,\"<=\"&E$4)","v":76500},{"$f":"SUMIFS(AR!$G$4:$G$200,AR!$H$4:$H$200,\">\"&F$4-7,AR!$H$4:$H$200,\"<=\"&F$4)","v":0},{"$f":"SUMIFS(AR!$G$4:$G$200,AR!$H$4:$H$200,\">\"&G$4-7,AR!$H$4:$H$200,\"<=\"&G$4)","v":130500},{"$f":"SUMIFS(AR!$G$4:$G$200,AR!$H$4:$H$200,\">\"&H$4-7,AR!$H$4:$H$200,\"<=\"&H$4)","v":94250},{"$f":"SUMIFS(AR!$G$4:$G$200,AR!$H$4:$H$200,\">\"&I$4-7,AR!$H$4:$H$200,\"<=\"&I$4)","v":25875},{"$f":"SUMIFS(AR!$G$4:$G$200,AR!$H$4:$H$200,\">\"&J$4-7,AR!$H$4:$H$200,\"<=\"&J$4)","v":0},{"$f":"SUMIFS(AR!$G$4:$G$200,AR!$H$4:$H$200,\">\"&K$4-7,AR!$H$4:$H$200,\"<=\"&K$4)","v":0},{"$f":"SUMIFS(AR!$G$4:$G$200,AR!$H$4:$H$200,\">\"&L$4-7,AR!$H$4:$H$200,\"<=\"&L$4)","v":0},{"$f":"SUMIFS(AR!$G$4:$G$200,AR!$H$4:$H$200,\">\"&M$4-7,AR!$H$4:$H$200,\"<=\"&M$4)","v":0},{"$f":"SUMIFS(AR!$G$4:$G$200,AR!$H$4:$H$200,\">\"&N$4-7,AR!$H$4:$H$200,\"<=\"&N$4)","v":0},{"$f":"SUMIFS(AR!$G$4:$G$200,AR!$H$4:$H$200,\">\"&O$4-7,AR!$H$4:$H$200,\"<=\"&O$4)","v":0}]
["Other Operating Receipts",null,{"$f":"SUMIFS('Other Cash Flows'!$G$4:$G$200,'Other Cash Flows'!$E$4:$E$200,\">\"&C$4-7,'Other Cash Flows'!$E$4:$E$200,\"<=\"&C$4,'Other Cash Flows'!$G$4:$G$200,\">0\")","v":0},{"$f":"SUMIFS('Other Cash Flows'!$G$4:$G$200,'Other Cash Flows'!$E$4:$E$200,\">\"&D$4-7,'Other Cash Flows'!$E$4:$E$200,\"<=\"&D$4,'Other Cash Flows'!$G$4:$G$200,\">0\")","v":0},{"$f":"SUMIFS('Other Cash Flows'!$G$4:$G$200,'Other Cash Flows'!$E$4:$E$200,\">\"&E$4-7,'Other Cash Flows'!$E$4:$E$200,\"<=\"&E$4,'Other Cash Flows'!$G$4:$G$200,\">0\")","v":0},{"$f":"SUMIFS('Other Cash Flows'!$G$4:$G$200,'Other Cash Flows'!$E$4:$E$200,\">\"&F$4-7,'Other Cash Flows'!$E$4:$E$200,\"<=\"&F$4,'Other Cash Flows'!$G$4:$G$200,\">0\")","v":0},{"$f":"SUMIFS('Other Cash Flows'!$G$4:$G$200,'Other Cash Flows'!$E$4:$E$200,\">\"&G$4-7,'Other Cash Flows'!$E$4:$E$200,\"<=\"&G$4,'Other Cash Flows'!$G$4:$G$200,\">0\")","v":0},{"$f":"SUMIFS('Other Cash Flows'!$G$4:$G$200,'Other Cash Flows'!$E$4:$E$200,\">\"&H$4-7,'Other Cash Flows'!$E$4:$E$200,\"<=\"&H$4,'Other Cash Flows'!$G$4:$G$200,\">0\")","v":0},{"$f":"SUMIFS('Other Cash Flows'!$G$4:$G$200,'Other Cash Flows'!$E$4:$E$200,\">\"&I$4-7,'Other Cash Flows'!$E$4:$E$200,\"<=\"&I$4,'Other Cash Flows'!$G$4:$G$200,\">0\")","v":0},{"$f":"SUMIFS('Other Cash Flows'!$G$4:$G$200,'Other Cash Flows'!$E$4:$E$200,\">\"&J$4-7,'Other Cash Flows'!$E$4:$E$200,\"<=\"&J$4,'Other Cash Flows'!$G$4:$G$200,\">0\")","v":0},{"$f":"SUMIFS('Other Cash Flows'!$G$4:$G$200,'Other Cash Flows'!$E$4:$E$200,\">\"&K$4-7,'Other Cash Flows'!$E$4:$E$200,\"<=\"&K$4,'Other Cash Flows'!$G$4:$G$200,\">0\")","v":0},{"$f":"SUMIFS('Other Cash Flows'!$G$4:$G$200,'Other Cash Flows'!$E$4:$E$200,\">\"&L$4-7,'Other Cash Flows'!$E$4:$E$200,\"<=\"&L$4,'Other Cash Flows'!$G$4:$G$200,\">0\")","v":0},{"$f":"SUMIFS('Other Cash Flows'!$G$4:$G$200,'Other Cash Flows'!$E$4:$E$200,\">\"&M$4-7,'Other Cash Flows'!$E$4:$E$200,\"<=\"&M$4,'Other Cash Flows'!$G$4:$G$200,\">0\")","v":11500},{"$f":"SUMIFS('Other Cash Flows'!$G$4:$G$200,'Other Cash Flows'!$E$4:$E$200,\">\"&N$4-7,'Other Cash Flows'!$E$4:$E$200,\"<=\"&N$4,'Other Cash Flows'!$G$4:$G$200,\">0\")","v":0},{"$f":"SUMIFS('Other Cash Flows'!$G$4:$G$200,'Other Cash Flows'!$E$4:$E$200,\">\"&O$4-7,'Other Cash Flows'!$E$4:$E$200,\"<=\"&O$4,'Other Cash Flows'!$G$4:$G$200,\">0\")","v":0}]
["Total Cash Receipts",null,{"$f":"SUM(C9:C10)","v":0},0,76500,0,130500,94250,25875,0,0,0,11500,0,0]
[]
["CASH DISBURSEMENTS"]
["Payroll, Taxes & Benefits",null,{"$f":"IFERROR(__xludf.DUMMYFUNCTION(\"-IF(\n  COUNTIFS(\n    'Payroll Calendar'!$C:$C,\"\">\"\"&C$4,\n    'Payroll Calendar'!$C:$C,\"\"<=\"\"&D$4\n  )=0,\n  0,\n  SUM(\n    FILTER(\n      Headcount!$H$4:$H999,\n      Headcount!$I$4:$I999<=MIN(\n        FILTER(\n          'Payroll Calendar'!$C:$C,\n          'Pay\"&\"roll Calendar'!$C:$C>C$4,\n          'Payroll Calendar'!$C:$C<=D$4\n        )\n      ),\n      (Headcount!$J$4:$J999=\"\"\"\")+\n      (\n        Headcount!$J$4:$J999>=MIN(\n          FILTER(\n            'Payroll Calendar'!$C:$C,\n            'Payroll Calendar'!$C:$C\"&\">C$4,\n            'Payroll Calendar'!$C:$C<=D$4\n          )\n        )\n      )\n    )\n  )\n)\"),-14600.0)","v":-14600},{"$f":"IFERROR(__xludf.DUMMYFUNCTION(\"-IF(\n  COUNTIFS(\n    'Payroll Calendar'!$C:$C,\"\">\"\"&D$4,\n    'Payroll Calendar'!$C:$C,\"\"<=\"\"&E$4\n  )=0,\n  0,\n  SUM(\n    FILTER(\n      Headcount!$H$4:$H999,\n      Headcount!$I$4:$I999<=MIN(\n        FILTER(\n          'Payroll Calendar'!$C:$C,\n          'Pay\"&\"roll Calendar'!$C:$C>D$4,\n          'Payroll Calendar'!$C:$C<=E$4\n        )\n      ),\n      (Headcount!$J$4:$J999=\"\"\"\")+\n      (\n        Headcount!$J$4:$J999>=MIN(\n          FILTER(\n            'Payroll Calendar'!$C:$C,\n            'Payroll Calendar'!$C:$C\"&\">D$4,\n            'Payroll Calendar'!$C:$C<=E$4\n          )\n        )\n      )\n    )\n  )\n)\"),0.0)","v":0},{"$f":"IFERROR(__xludf.DUMMYFUNCTION(\"-IF(\n  COUNTIFS(\n    'Payroll Calendar'!$C:$C,\"\">\"\"&E$4,\n    'Payroll Calendar'!$C:$C,\"\"<=\"\"&F$4\n  )=0,\n  0,\n  SUM(\n    FILTER(\n      Headcount!$H$4:$H999,\n      Headcount!$I$4:$I999<=MIN(\n        FILTER(\n          'Payroll Calendar'!$C:$C,\n          'Pay\"&\"roll Calendar'!$C:$C>E$4,\n          'Payroll Calendar'!$C:$C<=F$4\n        )\n      ),\n      (Headcount!$J$4:$J999=\"\"\"\")+\n      (\n        Headcount!$J$4:$J999>=MIN(\n          FILTER(\n            'Payroll Calendar'!$C:$C,\n            'Payroll Calendar'!$C:$C\"&\">E$4,\n            'Payroll Calendar'!$C:$C<=F$4\n          )\n        )\n      )\n    )\n  )\n)\"),-14600.0)","v":-14600},{"$f":"IFERROR(__xludf.DUMMYFUNCTION(\"-IF(\n  COUNTIFS(\n    'Payroll Calendar'!$C:$C,\"\">\"\"&F$4,\n    'Payroll Calendar'!$C:$C,\"\"<=\"\"&G$4\n  )=0,\n  0,\n  SUM(\n    FILTER(\n      Headcount!$H$4:$H999,\n      Headcount!$I$4:$I999<=MIN(\n        FILTER(\n          'Payroll Calendar'!$C:$C,\n          'Pay\"&\"roll Calendar'!$C:$C>F$4,\n          'Payroll Calendar'!$C:$C<=G$4\n        )\n      ),\n      (Headcount!$J$4:$J999=\"\"\"\")+\n      (\n        Headcount!$J$4:$J999>=MIN(\n          FILTER(\n            'Payroll Calendar'!$C:$C,\n            'Payroll Calendar'!$C:$C\"&\">F$4,\n            'Payroll Calendar'!$C:$C<=G$4\n          )\n        )\n      )\n    )\n  )\n)\"),0.0)","v":0},{"$f":"IFERROR(__xludf.DUMMYFUNCTION(\"-IF(\n  COUNTIFS(\n    'Payroll Calendar'!$C:$C,\"\">\"\"&G$4,\n    'Payroll Calendar'!$C:$C,\"\"<=\"\"&H$4\n  )=0,\n  0,\n  SUM(\n    FILTER(\n      Headcount!$H$4:$H999,\n      Headcount!$I$4:$I999<=MIN(\n        FILTER(\n          'Payroll Calendar'!$C:$C,\n          'Pay\"&\"roll Calendar'!$C:$C>G$4,\n          'Payroll Calendar'!$C:$C<=H$4\n        )\n      ),\n      (Headcount!$J$4:$J999=\"\"\"\")+\n      (\n        Headcount!$J$4:$J999>=MIN(\n          FILTER(\n            'Payroll Calendar'!$C:$C,\n            'Payroll Calendar'!$C:$C\"&\">G$4,\n            'Payroll Calendar'!$C:$C<=H$4\n          )\n        )\n      )\n    )\n  )\n)\"),-14600.0)","v":-14600},{"$f":"IFERROR(__xludf.DUMMYFUNCTION(\"-IF(\n  COUNTIFS(\n    'Payroll Calendar'!$C:$C,\"\">\"\"&H$4,\n    'Payroll Calendar'!$C:$C,\"\"<=\"\"&I$4\n  )=0,\n  0,\n  SUM(\n    FILTER(\n      Headcount!$H$4:$H999,\n      Headcount!$I$4:$I999<=MIN(\n        FILTER(\n          'Payroll Calendar'!$C:$C,\n          'Pay\"&\"roll Calendar'!$C:$C>H$4,\n          'Payroll Calendar'!$C:$C<=I$4\n        )\n      ),\n      (Headcount!$J$4:$J999=\"\"\"\")+\n      (\n        Headcount!$J$4:$J999>=MIN(\n          FILTER(\n            'Payroll Calendar'!$C:$C,\n            'Payroll Calendar'!$C:$C\"&\">H$4,\n            'Payroll Calendar'!$C:$C<=I$4\n          )\n        )\n      )\n    )\n  )\n)\"),0.0)","v":0},{"$f":"IFERROR(__xludf.DUMMYFUNCTION(\"-IF(\n  COUNTIFS(\n    'Payroll Calendar'!$C:$C,\"\">\"\"&I$4,\n    'Payroll Calendar'!$C:$C,\"\"<=\"\"&J$4\n  )=0,\n  0,\n  SUM(\n    FILTER(\n      Headcount!$H$4:$H999,\n      Headcount!$I$4:$I999<=MIN(\n        FILTER(\n          'Payroll Calendar'!$C:$C,\n          'Pay\"&\"roll Calendar'!$C:$C>I$4,\n          'Payroll Calendar'!$C:$C<=J$4\n        )\n      ),\n      (Headcount!$J$4:$J999=\"\"\"\")+\n      (\n        Headcount!$J$4:$J999>=MIN(\n          FILTER(\n            'Payroll Calendar'!$C:$C,\n            'Payroll Calendar'!$C:$C\"&\">I$4,\n            'Payroll Calendar'!$C:$C<=J$4\n          )\n        )\n      )\n    )\n  )\n)\"),-14600.0)","v":-14600},{"$f":"IFERROR(__xludf.DUMMYFUNCTION(\"-IF(\n  COUNTIFS(\n    'Payroll Calendar'!$C:$C,\"\">\"\"&J$4,\n    'Payroll Calendar'!$C:$C,\"\"<=\"\"&K$4\n  )=0,\n  0,\n  SUM(\n    FILTER(\n      Headcount!$H$4:$H999,\n      Headcount!$I$4:$I999<=MIN(\n        FILTER(\n          'Payroll Calendar'!$C:$C,\n          'Pay\"&\"roll Calendar'!$C:$C>J$4,\n          'Payroll Calendar'!$C:$C<=K$4\n        )\n      ),\n      (Headcount!$J$4:$J999=\"\"\"\")+\n      (\n        Headcount!$J$4:$J999>=MIN(\n          FILTER(\n            'Payroll Calendar'!$C:$C,\n            'Payroll Calendar'!$C:$C\"&\">J$4,\n            'Payroll Calendar'!$C:$C<=K$4\n          )\n        )\n      )\n    )\n  )\n)\"),0.0)","v":0},{"$f":"IFERROR(__xludf.DUMMYFUNCTION(\"-IF(\n  COUNTIFS(\n    'Payroll Calendar'!$C:$C,\"\">\"\"&K$4,\n    'Payroll Calendar'!$C:$C,\"\"<=\"\"&L$4\n  )=0,\n  0,\n  SUM(\n    FILTER(\n      Headcount!$H$4:$H999,\n      Headcount!$I$4:$I999<=MIN(\n        FILTER(\n          'Payroll Calendar'!$C:$C,\n          'Pay\"&\"roll Calendar'!$C:$C>K$4,\n          'Payroll Calendar'!$C:$C<=L$4\n        )\n      ),\n      (Headcount!$J$4:$J999=\"\"\"\")+\n      (\n        Headcount!$J$4:$J999>=MIN(\n          FILTER(\n            'Payroll Calendar'!$C:$C,\n            'Payroll Calendar'!$C:$C\"&\">K$4,\n            'Payroll Calendar'!$C:$C<=L$4\n          )\n        )\n      )\n    )\n  )\n)\"),-18992.307692307695)","v":-18992.30769},{"$f":"IFERROR(__xludf.DUMMYFUNCTION(\"-IF(\n  COUNTIFS(\n    'Payroll Calendar'!$C:$C,\"\">\"\"&L$4,\n    'Payroll Calendar'!$C:$C,\"\"<=\"\"&M$4\n  )=0,\n  0,\n  SUM(\n    FILTER(\n      Headcount!$H$4:$H999,\n      Headcount!$I$4:$I999<=MIN(\n        FILTER(\n          'Payroll Calendar'!$C:$C,\n          'Pay\"&\"roll Calendar'!$C:$C>L$4,\n          'Payroll Calendar'!$C:$C<=M$4\n        )\n      ),\n      (Headcount!$J$4:$J999=\"\"\"\")+\n      (\n        Headcount!$J$4:$J999>=MIN(\n          FILTER(\n            'Payroll Calendar'!$C:$C,\n            'Payroll Calendar'!$C:$C\"&\">L$4,\n            'Payroll Calendar'!$C:$C<=M$4\n          )\n        )\n      )\n    )\n  )\n)\"),0.0)","v":0},{"$f":"IFERROR(__xludf.DUMMYFUNCTION(\"-IF(\n  COUNTIFS(\n    'Payroll Calendar'!$C:$C,\"\">\"\"&M$4,\n    'Payroll Calendar'!$C:$C,\"\"<=\"\"&N$4\n  )=0,\n  0,\n  SUM(\n    FILTER(\n      Headcount!$H$4:$H999,\n      Headcount!$I$4:$I999<=MIN(\n        FILTER(\n          'Payroll Calendar'!$C:$C,\n          'Pay\"&\"roll Calendar'!$C:$C>M$4,\n          'Payroll Calendar'!$C:$C<=N$4\n        )\n      ),\n      (Headcount!$J$4:$J999=\"\"\"\")+\n      (\n        Headcount!$J$4:$J999>=MIN(\n          FILTER(\n            'Payroll Calendar'!$C:$C,\n            'Payroll Calendar'!$C:$C\"&\">M$4,\n            'Payroll Calendar'!$C:$C<=N$4\n          )\n        )\n      )\n    )\n  )\n)\"),-18992.307692307695)","v":-18992.30769},{"$f":"IFERROR(__xludf.DUMMYFUNCTION(\"-IF(\n  COUNTIFS(\n    'Payroll Calendar'!$C:$C,\"\">\"\"&N$4,\n    'Payroll Calendar'!$C:$C,\"\"<=\"\"&O$4\n  )=0,\n  0,\n  SUM(\n    FILTER(\n      Headcount!$H$4:$H999,\n      Headcount!$I$4:$I999<=MIN(\n        FILTER(\n          'Payroll Calendar'!$C:$C,\n          'Pay\"&\"roll Calendar'!$C:$C>N$4,\n          'Payroll Calendar'!$C:$C<=O$4\n        )\n      ),\n      (Headcount!$J$4:$J999=\"\"\"\")+\n      (\n        Headcount!$J$4:$J999>=MIN(\n          FILTER(\n            'Payroll Calendar'!$C:$C,\n            'Payroll Calendar'!$C:$C\"&\">N$4,\n            'Payroll Calendar'!$C:$C<=O$4\n          )\n        )\n      )\n    )\n  )\n)\"),0.0)","v":0},{"$f":"IFERROR(__xludf.DUMMYFUNCTION(\"-IF(\n  COUNTIFS(\n    'Payroll Calendar'!$C:$C,\"\">\"\"&O$4,\n    'Payroll Calendar'!$C:$C,\"\"<=\"\"&P$4\n  )=0,\n  0,\n  SUM(\n    FILTER(\n      Headcount!$H$4:$H999,\n      Headcount!$I$4:$I999<=MIN(\n        FILTER(\n          'Payroll Calendar'!$C:$C,\n          'Pay\"&\"roll Calendar'!$C:$C>O$4,\n          'Payroll Calendar'!$C:$C<=P$4\n        )\n      ),\n      (Headcount!$J$4:$J999=\"\"\"\")+\n      (\n        Headcount!$J$4:$J999>=MIN(\n          FILTER(\n            'Payroll Calendar'!$C:$C,\n            'Payroll Calendar'!$C:$C\"&\">O$4,\n            'Payroll Calendar'!$C:$C<=P$4\n          )\n        )\n      )\n    )\n  )\n)\"),0.0)","v":0}]
["A/P / Vendor Payments",null,{"$f":"-SUMIFS(AP!$G$4:$G$200,AP!$H$4:$H$200,\">\"&C$4-7,AP!$H$4:$H$200,\"<=\"&C$4)","v":0},{"$f":"-SUMIFS(AP!$G$4:$G$200,AP!$H$4:$H$200,\">\"&D$4-7,AP!$H$4:$H$200,\"<=\"&D$4)","v":0},{"$f":"-SUMIFS(AP!$G$4:$G$200,AP!$H$4:$H$200,\">\"&E$4-7,AP!$H$4:$H$200,\"<=\"&E$4)","v":0},{"$f":"-SUMIFS(AP!$G$4:$G$200,AP!$H$4:$H$200,\">\"&F$4-7,AP!$H$4:$H$200,\"<=\"&F$4)","v":0},{"$f":"-SUMIFS(AP!$G$4:$G$200,AP!$H$4:$H$200,\">\"&G$4-7,AP!$H$4:$H$200,\"<=\"&G$4)","v":-23000},{"$f":"-SUMIFS(AP!$G$4:$G$200,AP!$H$4:$H$200,\">\"&H$4-7,AP!$H$4:$H$200,\"<=\"&H$4)","v":-150000},{"$f":"-SUMIFS(AP!$G$4:$G$200,AP!$H$4:$H$200,\">\"&I$4-7,AP!$H$4:$H$200,\"<=\"&I$4)","v":0},{"$f":"-SUMIFS(AP!$G$4:$G$200,AP!$H$4:$H$200,\">\"&J$4-7,AP!$H$4:$H$200,\"<=\"&J$4)","v":-38216.945},{"$f":"-SUMIFS(AP!$G$4:$G$200,AP!$H$4:$H$200,\">\"&K$4-7,AP!$H$4:$H$200,\"<=\"&K$4)","v":0},{"$f":"-SUMIFS(AP!$G$4:$G$200,AP!$H$4:$H$200,\">\"&L$4-7,AP!$H$4:$H$200,\"<=\"&L$4)","v":0},{"$f":"-SUMIFS(AP!$G$4:$G$200,AP!$H$4:$H$200,\">\"&M$4-7,AP!$H$4:$H$200,\"<=\"&M$4)","v":0},{"$f":"-SUMIFS(AP!$G$4:$G$200,AP!$H$4:$H$200,\">\"&N$4-7,AP!$H$4:$H$200,\"<=\"&N$4)","v":0},{"$f":"-SUMIFS(AP!$G$4:$G$200,AP!$H$4:$H$200,\">\"&O$4-7,AP!$H$4:$H$200,\"<=\"&O$4)","v":0}]
{"$rows_left_out":25}
{"sheet":"Inputs","index":2,"n_rows":20,"n_cols":7,"rows_kept":20,"cut":false,"hidden":false,"merged":[[17,1,17,7],[18,1,18,7],[19,1,19,7],[0,0,0,7],[2,0,2,3],[2,5,2,7],[13,0,13,7],[14,1,14,7],[15,1,15,7],[16,1,16,7]]}
["13-Week Cash Flow Forecast — Inputs & Control Panel"]
[]
["Forecast Control",null,null,null,null,"Model Conventions"]
["Forecast Start (Monday)","2026-08-01",null,null,null,"Blue font","Hardcoded / scenario inputs"]
["Minimum Cash Threshold",150000.0,null,null,null,"Green font","Links from supporting tabs"]
["Beginning Cash Balance",375000.0,null,null,null,"Black font","Formulas on same tab"]
["Beginning Revolver Drawn",0.0,null,null,null,"Yellow fill","Input requiring review/update"]
["Revolver Commitment",500000.0,null,null,null,"Forecast horizon","13 weekly periods"]
["Minimum Revolver Draw",0.0,null,null,null,"Timing convention","Week ending Sunday"]
["Payroll Burden %",0.12,null,null,null,"Purpose","Liquidity management / PE reporting"]
["Default Benefits / Employee / Month",650.0]
[]
[]
["Recommended Weekly Update Process"]
[1.0,"Roll forecast forward one week; update Forecast Start."]
{"$rows_left_out":6}
{"sheet":"AR","index":3,"n_rows":200,"n_cols":10,"rows_kept":200,"cut":false,"hidden":false,"merged":[[0,0,0,9]]}
["Accounts Receivable — Expected Collections"]
[]
["Customer / Payer","Invoice / Ref","Invoice Date","Due Date","Gross A/R ($)","Collection %","Expected Collection ($)","Expected Cash Date","Confidence","Notes"]
["Example Customer A","INV-1001","2026-07-15","2026-08-15",145000.0,0.9,{"$f":"E4*F4","v":130500},"2026-09-04","High"]
["Example Customer B","INV-1002","2026-08-01","2026-08-31",34500.0,0.75,25875,"2026-09-18","Medium"]
["Example Customer C","INV-1003","2026-07-10","2026-09-10",145000.0,0.65,94250,"2026-09-11","High"]
["Example Customer D","INV-1004","2026-07-26","2026-08-25",85000.0,0.9,76500,"2026-08-15","High"]
[null,null,null,null,null,null,0]
[null,null,null,null,null,null,0]
[null,null,null,null,null,null,0]
[null,null,null,null,null,null,0]
[null,null,null,null,null,null,0]
[null,null,null,null,null,null,0]
[null,null,null,null,null,null,0]
[null,null,null,null,null,null,0]
{"$rows_left_out":186}
{"sheet":"AP","index":4,"n_rows":200,"n_cols":10,"rows_kept":200,"cut":false,"hidden":false,"merged":[[0,0,0,9]]}
["Accounts Payable — Expected Disbursements"]
[]
["Vendor","Invoice / Ref","Invoice Date","Due Date","Open A/P ($)","Payment %","Expected Payment ($)","Expected Cash Date","Priority","Notes"]
["Example Vendor A","BILL-2001","2026-08-01","2026-08-31",23000.0,1.0,{"$f":"E4*F4","v":23000},"2026-09-04","Critical","Replace with live A/P detail"]
["Example Vendor B","BILL-2002","2026-07-10","2026-09-09",150000.0,1.0,150000,"2026-09-11","Normal"]
["Example Vendor C","BILL-2003","2026-07-15","2026-09-14",76433.89,0.5,38216.945,"2026-09-25","Deferrable","Staged payment"]
[null,null,null,null,null,null,0]
[null,null,null,null,null,null,0]
[null,null,null,null,null,null,0]
[null,null,null,null,null,null,0]
[null,null,null,null,null,null,0]
[null,null,null,null,null,null,0]
[null,null,null,null,null,null,0]
[null,null,null,null,null,null,0]
[null,null,null,null,null,null,0]
{"$rows_left_out":186}
{"sheet":"Headcount","index":5,"n_rows":200,"n_cols":12,"rows_kept":200,"cut":false,"hidden":false,"merged":[[0,0,0,11]]}
["Headcount & Payroll Cash Forecast"]
[]
["Employee","Department","Status","Annual Base ($)","Weekly Base ($)","Payroll Burden %","Monthly Benefits ($)","Fully Burdened Labor ($)","Start Date","Termination Date","Pay Frequency","Notes"]
["Executive #1","G&A","Active",250000.0,{"$f":"D4/52","v":4807.692308},{"$f":"Inputs!$B$10","v":0.12},{"$f":"Inputs!$B$11","v":650},{"$f":"IFERROR(\n  SWITCH(\n    K4,\n    \"Weekly\",(E4*(1+F4))+(G4*12/52),\n    \"Biweekly\",(E4*(1+F4)*2)+(G4*12/26),\n    \"Semi-Monthly\",((D4/24)*(1+F4))+(G4/2),\n    \"Monthly\",((D4/12)*(1+F4))+G4,\n    0\n  ),\n0)","v":11069.23077},"2025-01-01",null,"Biweekly"]
["Operations Lead #1","Operations","Active",75000.0,1442.307692,{"$f":"Inputs!$B$10","v":0.12},{"$f":"Inputs!$B$11","v":650},3530.769231,"2025-01-01",null,"Biweekly"]
["Planned Sales Team Hire #1","Sales","Planned",95000.0,1826.923077,{"$f":"Inputs!$B$10","v":0.12},{"$f":"Inputs!$B$11","v":650},4392.307692,"2026-10-01",null,"Biweekly"]
[null,null,null,null,0,{"$f":"Inputs!$B$10","v":0.12},{"$f":"Inputs!$B$11","v":650},0]
[null,null,null,null,0,{"$f":"Inputs!$B$10","v":0.12},{"$f":"Inputs!$B$11","v":650},0]
[null,null,null,null,0,{"$f":"Inputs!$B$10","v":0.12},{"$f":"Inputs!$B$11","v":650},0]
[null,null,null,null,0,{"$f":"Inputs!$B$10","v":0.12},{"$f":"Inputs!$B$11","v":650},0]
[null,null,null,null,0,{"$f":"Inputs!$B$10","v":0.12},{"$f":"Inputs!$B$11","v":650},0]
[null,null,null,null,0,{"$f":"Inputs!$B$10","v":0.12},{"$f":"Inputs!$B$11","v":650},0]
[null,null,null,null,0,{"$f":"Inputs!$B$10","v":0.12},{"$f":"Inputs!$B$11","v":650},0]
[null,null,null,null,0,{"$f":"Inputs!$B$10","v":0.12},{"$f":"Inputs!$B$11","v":650},0]
[null,null,null,null,0,{"$f":"Inputs!$B$10","v":0.12},{"$f":"Inputs!$B$11","v":650},0]
{"$rows_left_out":186}
{"sheet":"Payroll Calendar","index":6,"n_rows":55,"n_cols":3,"rows_kept":55,"cut":false,"hidden":false,"merged":[[0,0,0,7]]}
["Payroll Period Calendar"]
[]
["Pay Period Start Date","Pay Period End Date","Pay Date"]
["2025-12-29","2026-01-11","2026-01-16"]
[{"$f":"A4+14","v":"2026-01-12"},"2026-01-25","2026-01-30"]
[{"$f":"A5+14","v":"2026-01-26"},"2026-02-08","2026-02-13"]
[{"$f":"A6+14","v":"2026-02-09"},"2026-02-22","2026-02-27"]
[{"$f":"A7+14","v":"2026-02-23"},"2026-03-08","2026-03-13"]
[{"$f":"A8+14","v":"2026-03-09"},"2026-03-22","2026-03-27"]
[{"$f":"A9+14","v":"2026-03-23"},"2026-04-05","2026-04-10"]
[{"$f":"A10+14","v":"2026-04-06"},"2026-04-19","2026-04-24"]
[{"$f":"A11+14","v":"2026-04-20"},"2026-05-03","2026-05-08"]
[{"$f":"A12+14","v":"2026-05-04"},"2026-05-17","2026-05-22"]
[{"$f":"A13+14","v":"2026-05-18"},"2026-05-31","2026-06-05"]
[{"$f":"A14+14","v":"2026-06-01"},"2026-06-14","2026-06-19"]
{"$rows_left_out":41}
{"sheet":"Other Cash Flows","index":7,"n_rows":200,"n_cols":8,"rows_kept":200,"cut":false,"hidden":false,"merged":[[0,0,0,7]]}
["Other Cash Flows — Non-A/R, Non-A/P Items"]
[]
["Category","Description","Cash Flow Type","Amount ($)","Expected Cash Date","Probability %","Risk-Adjusted Amount ($)","Notes"]
["Taxes","Quarterly estimated tax","Outflow",-55000.0,"2026-09-15",1.0,{"$f":"D4*F4","v":-55000}]
["Capex","Equipment purchase","Outflow",-75000.0,"2026-10-02",1.0,-75000]
["Other Receipt","Insurance recovery","Inflow",23000.0,"2026-10-16",0.5,11500]
[null,null,null,null,null,null,0]
[null,null,null,null,null,null,0]
[null,null,null,null,null,null,0]
[null,null,null,null,null,null,0]
[null,null,null,null,null,null,0]
[null,null,null,null,null,null,0]
[null,null,null,null,null,null,0]
[null,null,null,null,null,null,0]
[null,null,null,null,null,null,0]
{"$rows_left_out":186}
{"sheet":"Debt & Liquidity","index":8,"n_rows":9,"n_cols":2,"rows_kept":9,"cut":false,"hidden":false,"merged":[[0,0,0,7],[2,0,2,3]]}
["Debt & Liquidity"]
[]
["Facility Summary"]
["Revolver Commitment",{"$f":"Inputs!B8","v":500000}]
["Beginning Revolver Drawn",{"$f":"Inputs!B7","v":0}]
["Beginning Availability",{"$f":"B4-B5","v":500000}]
["Minimum Cash Threshold",{"$f":"Inputs!B5","v":150000}]
["Maximum Practical Liquidity",{"$f":"Inputs!B6+B6","v":875000}]
["Notes","Customize for borrowing-base, covenant, notice-period, or minimum-draw restrictions."]